Safety performance KPIS
type: Ontology
created: 2026-05-05T08:54:16.284Z
creator: Michal Med
description: The basic concepts of the Safety performance KPIS ontology are the concepts of 'inspection', 'trail' and 'point'. An inspection is a record of an inspection that takes place at a given time on a given route that the inspector drives or passes through and records situations that may endanger the safety of air traffic. A trail is the route on which the inspection takes place. A point is a point that is recorded using a GPS device that the inspector carries with him.
description: Základními pojmy ontoloige Safety performance KPIS jsou pojmy 'inspection', 'trail' a 'point'. Inspection je záznamem kontroly, která probíháý v daném čase na dané trase, kterou inspektor projíždí nebo prochází a zaznamenává situace, které mohou ohrozit bezpečnost leteckého provozu. Trail je trasa, na které daná inspekce probíhá. Point je bodem, který je zaznamenán pomocí přístroje GPS, který má inspektor u sebe. @cs
language: en
title: Výkon bezpečnosti KPIs @cs
preferred namespace uri: http://onto.fel.cvut.cz/ontologies/slovník/agendový/safety-performance-kpis/pojem/
type: NamedIndividual
type: pojem
type: ConceptScheme

updated by
type: ObjectProperty
type: NamedIndividual
type: Concept
type: typ-vztahu
in scheme: Safety performance KPIS
preferred label: aktualizována inspektorem @cs

is classified by
type: ObjectProperty
type: NamedIndividual
type: Concept
type: typ-vztahu
in scheme: Safety performance KPIS
preferred label: je klasifikován podle @cs
top concept of: Safety performance KPIS

is classified by inspection object
type: ObjectProperty
type: NamedIndividual
type: Concept
type: typ-vztahu
in scheme: Safety performance KPIS
preferred label: je klasifikována podle kontrolního objektu @cs
top concept of: Safety performance KPIS

is classified by organizational category
type: ObjectProperty
type: NamedIndividual
type: Concept
type: typ-vztahu
in scheme: Safety performance KPIS
preferred label: je klasifikována podle organizační kategorie @cs
top concept of: Safety performance KPIS

has point
type: ObjectProperty
type: NamedIndividual
type: Concept
type: typ-vztahu
in scheme: Safety performance KPIS
preferred label: má bod @cs

has inspector
type: ObjectProperty
type: NamedIndividual
type: Concept
type: typ-vztahu
in scheme: Safety performance KPIS
preferred label: má inspektora @cs

has condition check
type: ObjectProperty
type: NamedIndividual
type: Concept
type: typ-vztahu
in scheme: Safety performance KPIS
preferred label: má kontrolu stavu @cs
top concept of: Safety performance KPIS

has corrective action
type: ObjectProperty
type: NamedIndividual
type: Concept
type: typ-vztahu
in scheme: Safety performance KPIS
preferred label: má korektivní akci @cs

has priority
type: ObjectProperty
type: NamedIndividual
type: Concept
type: typ-vztahu
in scheme: Safety performance KPIS
preferred label: má prioritu @cs
top concept of: Safety performance KPIS

has condition check state
type: ObjectProperty
type: NamedIndividual
type: Concept
type: typ-vztahu
in scheme: Safety performance KPIS
preferred label: má status kontroly stavu @cs
top concept of: Safety performance KPIS

has condition
type: ObjectProperty
type: NamedIndividual
type: Concept
type: typ-vztahu
in scheme: Safety performance KPIS
preferred label: má stav @cs
top concept of: Safety performance KPIS

has corrective action state
type: ObjectProperty
type: NamedIndividual
type: Concept
type: typ-vztahu
in scheme: Safety performance KPIS
preferred label: má stav nápravného opatření @cs
top concept of: Safety performance KPIS

has corrective action type
type: ObjectProperty
type: NamedIndividual
type: Concept
type: typ-vztahu
in scheme: Safety performance KPIS
preferred label: má typ nápravného opatření @cs
top concept of: Safety performance KPIS

is located at
type: ObjectProperty
type: NamedIndividual
type: Concept
type: typ-vztahu
in scheme: Safety performance KPIS
preferred label: nachází se v @cs

takes place on the trail
type: ObjectProperty
type: NamedIndividual
type: Concept
type: typ-vztahu
in scheme: Safety performance KPIS
preferred label: probíhá na trase @cs

closed by
type: ObjectProperty
type: NamedIndividual
type: Concept
type: typ-vztahu
in scheme: Safety performance KPIS
preferred label: uzavřena inspektorem @cs

created by
type: ObjectProperty
type: NamedIndividual
type: Concept
type: typ-vztahu
in scheme: Safety performance KPIS
preferred label: vytvořena inspektorem @cs

inspection date
type: DatatypeProperty
type: NamedIndividual
type: Concept
type: typ-vlastnosti
in scheme: Safety performance KPIS
preferred label: datum kontroly @cs
top concept of: Safety performance KPIS

employee name
type: DatatypeProperty
type: NamedIndividual
type: Concept
type: typ-vlastnosti
in scheme: Safety performance KPIS
preferred label: jméno zaměstnance @cs
top concept of: Safety performance KPIS

point
type: Class
type: NamedIndividual
type: Concept
type: typ-objektu
má-stav-pojmu: navrhovaný-pojem
definition: Bod ležící na trase inspekce. @cs
definition: Point on the trail of inspection
in scheme: Safety performance KPIS
preferred label: bod @cs
top concept of: Safety performance KPIS

inspection
type: Class
type: NamedIndividual
type: Concept
type: typ-objektu
má-stav-pojmu: navrhovaný-pojem
definition: Inspection is a systematic and formal examination of airport, its equipment and operational processes done by inspection techicians on regular basis to ensure proper function and strict compliance with regulatory standards, leading to the overall safety.
definition: Inspekce je systematická a formální kontrola letiště, jeho vybavení a operačních procesů prováděná pravidelně inspekčními techniky za účelem zajištění správného fungování a důsleného dodržování předpisů. Je základem všěeobecné bezpečnosti letiště. @cs
in scheme: Safety performance KPIS
preferred label: inspekce @cs
top concept of: Safety performance KPIS

condition inspection
type: Class
type: NamedIndividual
type: Concept
type: typ-objektu
má-stav-pojmu: navrhovaný-pojem
definition: Check of specific condition within inspection.
definition: Kontrola konkrétního stavu v průběhu inspekce. @cs
in scheme: Safety performance KPIS
preferred label: kontrola stavu @cs
top concept of: Safety performance KPIS

discrepancy
type: Class
type: NamedIndividual
type: Concept
type: typ-objektu
má-stav-pojmu: navrhovaný-pojem
definition: Any irregularity, deficiency, or departure from regulatory standards or expected norms noted during an airport safety inspection.
definition: Jakákoliv nesrovnalost, nedostatek nebo odchylka od regulačních standardů či očekávaných norem zjištěná při bezpečnostní kontrole letiště. @cs
in scheme: Safety performance KPIS
preferred label: nedostatek @cs
top concept of: Safety performance KPIS

finding
type: Class
type: NamedIndividual
type: Concept
type: typ-objektu
má-stav-pojmu: navrhovaný-pojem
definition: Jednotlivá událost při inspekci. @cs
definition: Sigle event spotted during inspection.
in scheme: Safety performance KPIS
preferred label: nález @cs
top concept of: Safety performance KPIS

corrective action
type: Class
type: NamedIndividual
type: Concept
type: typ-objektu
má-stav-pojmu: navrhovaný-pojem
definition: Measures taken to eliminate the root cause or mitigate the impact of an identified hazard or non-compliant safety condition.
definition: Opatření přijatá k odstranění hlavní příčiny nebo zmírnění dopadu zjištěného nebezpečí či nevyhovujícího stavu na letišti. @cs
in scheme: Safety performance KPIS
preferred label: nápravné opatření @cs
top concept of: Safety performance KPIS

repair
type: Class
type: NamedIndividual
type: Concept
type: typ-objektu
má-stav-pojmu: navrhovaný-pojem
definition: Fyzické uvedení poškozené, znehodnocené nebo nefunkční letištní infrastruktury, plochy nebo vybavení zpět do provozuschopného stavu. @cs
definition: The physical restoration of damaged, degraded, or malfunctioning airport infrastructure, pavement, or equipment to a serviceable state.
in scheme: Safety performance KPIS
preferred label: oprava @cs
top concept of: Safety performance KPIS

priority
type: Class
type: NamedIndividual
type: Concept
type: typ-objektu
má-stav-pojmu: navrhovaný-pojem
definition: Stupeň naléhavosti přidělený zjištěnému nedostatku, který určuje, jak rychle musí být přijato nápravné opatření k zachování bezpečného provozu. @cs
definition: The level of urgency assigned to a discrepancy, determining how rapidly corrective action must be taken to maintain safe operations.
in scheme: Safety performance KPIS
preferred label: priorita @cs
top concept of: Safety performance KPIS

section
type: Class
type: NamedIndividual
type: Concept
type: typ-objektu
má-stav-pojmu: navrhovaný-pojem
definition: Section of the trail on which the inspection is taken.
definition: Část trasy na které je porováděna inspekce. @cs
in scheme: Safety performance KPIS
preferred label: sekce @cs
top concept of: Safety performance KPIS

condition inspection state
type: Class
type: NamedIndividual
type: Concept
type: typ-objektu
má-stav-pojmu: navrhovaný-pojem
definition: State of the check of specific condition during inspection.
definition: Status konkrétní kontroly stavu během inspekce. @cs
in scheme: Safety performance KPIS
preferred label: status kontroly stavu @cs
top concept of: Safety performance KPIS

condition
type: Class
type: NamedIndividual
type: Concept
type: typ-objektu
má-stav-pojmu: navrhovaný-pojem
definition: Fyzický stav, připravenost nebo provozuschopnost letištního zařízení, vybavení, plochy, povrchu nebo světelného systému v daném čase. @cs
definition: The physical state, readiness, or serviceability of an airport facility, eqipment, pavement, surface, or lighting system at a given time.
in scheme: Safety performance KPIS
preferred label: stav @cs
top concept of: Safety performance KPIS

corrective action state
type: Class
type: NamedIndividual
type: Concept
type: typ-objektu
má-stav-pojmu: navrhovaný-pojem
definition: State of the corrective action. List of allowed values will be added.
definition: Stav probíhajícího nápravného opatření. Seznam přípustných hodnot bude doplněn. @cs
in scheme: Safety performance KPIS
preferred label: stav nápravného opatření @cs
top concept of: Safety performance KPIS

trail
type: Class
type: NamedIndividual
type: Concept
type: typ-objektu
má-stav-pojmu: navrhovaný-pojem
definition: Trail on which the inspection is performed.
definition: Tras an akteré probíhá inspekce. @cs
in scheme: Safety performance KPIS
preferred label: trasa @cs
top concept of: Safety performance KPIS

inspection type
type: Class
type: NamedIndividual
type: Concept
type: typ-objektu
má-stav-pojmu: navrhovaný-pojem
definition: Typ probíhající inspekce. Přípúustné hodnoty budou doplněny později. @cs
definition: Type of inspection. Allowed valoued will be added.
in scheme: Safety performance KPIS
preferred label: typ inspekce @cs
top concept of: Safety performance KPIS

corrective action type
type: Class
type: NamedIndividual
type: Concept
type: typ-objektu
má-stav-pojmu: navrhovaný-pojem
definition: Typ nápravného opatření. Seznam přípustných hodnot bude doplněn. @cs
definition: Type of the corrective action. List of allowed values will be added.
in scheme: Safety performance KPIS
preferred label: typ nápravného opatření @cs
top concept of: Safety performance KPIS

employee
type: Class
type: NamedIndividual
type: Concept
type: typ-objektu
má-stav-pojmu: navrhovaný-pojem
definition: Authorized personnel, such as a reporting officer or maintenance staff, assigned to conduct inspections and ensure safety compliance.
definition: Oprávněná osoba, jako je bezpečnostní pracovník nebo údržbář, pověřený prováděním kontrol a zajištěním shody s bezpečnostními předpisy. @cs
in scheme: Safety performance KPIS
preferred label: zaměstnanec @cs
top concept of: Safety performance KPIS